{"text_format":"1","workbook":"xlsx","n_sheets":13,"sheets":["Micro Canal","data","NL","EN","DE","FR","NR","SP","SW","TS","ExtraTaal1","ExtraTaal2","ExtraTaal3"],"not_rendered":{"charts":0,"images":5,"macros":1,"external_links":2,"defined_names":0,"comments":0,"pivot_tables":0},"unopened":[],"bounds":{"document_bytes":16777216,"sheet_cells":100000,"rows_first":2000,"rows_last":500,"rows_between":2000,"halvings":0,"cell_chars":16384,"cell_head_chars":4096},"cells_cut":0,"cells_raw":0,"read":"whole","date_system":"1900"}

{"sheet":"Micro Canal","index":0,"n_rows":24,"n_cols":13,"rows_kept":24,"cut":false,"hidden":false,"merged":[[22,2,23,12],[15,1,15,12],[5,9,6,9],[1,1,1,10],[9,11,12,12],[10,1,10,3],[8,1,8,3],[9,1,9,3],[8,11,8,12],[4,5,4,8],[3,5,3,8],[3,9,3,10],[5,11,6,11],[5,10,6,10]]}
[]
[null,"Selectiontool Micro Canal"]
[]
[null,null,null,null,null,"Taal/Language/Sprache/Jazyk",null,null,null,"Español"]
[null,null,null,null,null,{"$f":"IF(data!$P$41=1,\"Uitvoering\",IF(data!$P$41=2,\"Version\",IF(data!$P$41=3,\"Ausfürhung\",IF(data!$P$41=4,\"Version\",IF(data!$P$41=5,\"Versjon\",IF(data!$P$41=6,\"Versión\",IF(data!$P$41=7,\"Modell\",IF(data!$P$41=8,\"Verze\",IF(data!$P$41=9,\"ExtraTaal1\",IF(data!$P$41=10,\"ExtraTaal2\",IF(data!$P$41=11,\"ExtraTaal3\",)))))))))))","v":"Versión"},null,null,null,{"$f":"data!M23","v":6},14]
[null,null,null,null,null,null,null,null,null,{"$f":"IF(data!$P$41=1,NL!B4,IF(data!$P$41=2,EN!B4,IF(data!$P$41=4,FR!B4,IF(data!$P$41=3,DE!B4,IF(data!$P$41=5,NR!B4,IF(data!$P$41=6,SP!B4,IF(data!$P$41=7,SW!B4,IF(data!$P$41=8,TS!B4,IF(data!$P$41=9,ExtraTaal1!B4,IF(data!$P$41=10,ExtraTaal2!B4,IF(data!$P$41=11,ExtraTaal3!B4,)))))))))))","v":"Altura"},{"$f":"IF(data!$P$41=1,NL!B6,IF(data!$P$41=2,EN!B6,IF(data!$P$41=4,FR!B6,IF(data!$P$41=3,DE!B6,IF(data!$P$41=5,NR!B6,IF(data!$P$41=6,SP!B6,IF(data!$P$41=7,SW!B6,IF(data!$P$41=8,TS!B6,IF(data!$P$41=9,ExtraTaal1!B6,IF(data!$P$41=10,ExtraTaal2!B6,IF(data!$P$41=11,ExtraTaal3!B6,)))))))))))","v":"Profund."},"[cm]"]
[null,{"$f":"IF(data!$P$41=1,NL!E5,IF(data!$P$41=2,EN!E5,IF(data!$P$41=4,FR!E5,IF(data!$P$41=3,DE!E5,IF(data!$P$41=5,NR!E5,IF(data!$P$41=6,SP!E5,IF(data!$P$41=7,SW!E5,IF(data!$P$41=8,TS!E5,IF(data!$P$41=9,ExtraTaal1!E5,IF(data!$P$41=10,ExtraTaal2!E5,IF(data!$P$41=11,ExtraTaal3!E5,)))))))))))","v":"Temperaturas"}]
[null,{"$f":"IF(data!$P$41=1,NL!B8,IF(data!$P$41=2,EN!B8,IF(data!$P$41=4,FR!B8,IF(data!$P$41=3,DE!B8,IF(data!$P$41=5,NR!B8,IF(data!$P$41=6,SP!B8,IF(data!$P$41=7,SW!B8,IF(data!$P$41=8,TS!B8,IF(data!$P$41=9,ExtraTaal1!B8,IF(data!$P$41=10,ExtraTaal2!B8,IF(data!$P$41=11,ExtraTaal3!B8,)))))))))))","v":"Calefacción:"}]
[null,{"$f":"IF(data!$P$41=1,NL!B9,IF(data!$P$41=2,EN!B9,IF(data!$P$41=4,FR!B9,IF(data!$P$41=3,DE!B9,IF(data!$P$41=5,NR!B9,IF(data!$P$41=6,SP!B9,IF(data!$P$41=7,SW!B9,IF(data!$P$41=8,TS!B9,IF(data!$P$41=9,ExtraTaal1!B9,IF(data!$P$41=10,ExtraTaal2!B9,IF(data!$P$41=11,ExtraTaal3!B9,)))))))))))","v":"Agua impulsión"},{"$f":"IF(data!$P$41=1,NL!C9,IF(data!$P$41=2,EN!C9,IF(data!$P$41=4,FR!C9,IF(data!$P$41=3,DE!C9,IF(data!$P$41=5,NR!C9,IF(data!$P$41=6,SP!C9,IF(data!$P$41=7,SW!C9,IF(data!$P$41=8,TS!C9,IF(data!$P$41=9,ExtraTaal1!C9,IF(data!$P$41=10,ExtraTaal2!C9,IF(data!$P$41=11,ExtraTaal3!C9,)))))))))))","v":0},{"$f":"IF(data!$P$41=1,NL!D9,IF(data!$P$41=2,EN!D9,IF(data!$P$41=4,FR!D9,IF(data!$P$41=3,DE!D9,IF(data!$P$41=5,NR!D9,IF(data!$P$41=6,SP!D9,IF(data!$P$41=7,SW!D9,IF(data!$P$41=8,TS!D9,IF(data!$P$41=9,ExtraTaal1!D9,IF(data!$P$41=10,ExtraTaal2!D9,IF(data!$P$41=11,ExtraTaal3!D9,)))))))))))","v":0},75,{"$f":"IF(data!$R$34=1,\"°C\",\"°F\")","v":"°C"},null,null,null,null,null,{"$f":"IF(data!$P$41=1,NL!G4,IF(data!$P$41=2,EN!G4,IF(data!$P$41=4,FR!G4,IF(data!$P$41=3,DE!G4,IF(data!$P$41=5,NR!G4,IF(data!$P$41=6,SP!G4,IF(data!$P$41=7,SW!G4,IF(data!$P$41=8,TS!G4,IF(data!$P$41=9,ExtraTaal1!G4,IF(data!$P$41=10,ExtraTaal2!G4,IF(data!$P$41=11,ExtraTaal3!G4,)))))))))))","v":"Convers. de unidades"},{"$f":"IF(data!$P$41=1,NL!M9,IF(data!$P$41=2,EN!M9,IF(data!$P$41=4,FR!M9,IF(data!$P$41=3,DE!M9,IF(data!$P$41=5,NR!M9,IF(data!$P$41=6,SP!M9,IF(data!$P$41=7,SW!M9,IF(data!$P$41=8,TS!M9,IF(data!$P$41=9,ExtraTaal1!M9,IF(data!$P$41=10,ExtraTaal2!M9,IF(data!$P$41=11,ExtraTaal3!M9,)))))))))))","v":0}]
[null,{"$f":"IF(data!$P$41=1,NL!B10,IF(data!$P$41=2,EN!B10,IF(data!$P$41=4,FR!B10,IF(data!$P$41=3,DE!B10,IF(data!$P$41=5,NR!B10,IF(data!$P$41=6,SP!B10,IF(data!$P$41=7,SW!B10,IF(data!$P$41=8,TS!B10,IF(data!$P$41=9,ExtraTaal1!B10,IF(data!$P$41=10,ExtraTaal2!B10,IF(data!$P$41=11,ExtraTaal3!B10,)))))))))))","v":"Agua retorno"},{"$f":"IF(data!$P$41=1,NL!C10,IF(data!$P$41=2,EN!C10,IF(data!$P$41=4,FR!C10,IF(data!$P$41=3,DE!C10,IF(data!$P$41=5,NR!C10,IF(data!$P$41=6,SP!C10,IF(data!$P$41=7,SW!C10,IF(data!$P$41=8,TS!C10,IF(data!$P$41=9,ExtraTaal1!C10,IF(data!$P$41=10,ExtraTaal2!C10,IF(data!$P$41=11,ExtraTaal3!C10,)))))))))))","v":0},{"$f":"IF(data!$P$41=1,NL!D10,IF(data!$P$41=2,EN!D10,IF(data!$P$41=4,FR!D10,IF(data!$P$41=3,DE!D10,IF(data!$P$41=5,NR!D10,IF(data!$P$41=6,SP!D10,IF(data!$P$41=7,SW!D10,IF(data!$P$41=8,TS!D10,IF(data!$P$41=9,ExtraTaal1!D10,IF(data!$P$41=10,ExtraTaal2!D10,IF(data!$P$41=11,ExtraTaal3!D10,)))))))))))","v":0},65,{"$f":"F9","v":"°C"}]
[null,{"$f":"IF(data!$P$41=1,NL!B11,IF(data!$P$41=2,EN!B11,IF(data!$P$41=4,FR!B11,IF(data!$P$41=3,DE!B11,IF(data!$P$41=5,NR!B11,IF(data!$P$41=6,SP!B11,IF(data!$P$41=7,SW!B11,IF(data!$P$41=8,TS!B11,IF(data!$P$41=9,ExtraTaal1!B11,IF(data!$P$41=10,ExtraTaal2!B11,IF(data!$P$41=11,ExtraTaal3!B11,)))))))))))","v":"Ambiente (bulbo seco)"},{"$f":"IF(data!$P$41=1,NL!C11,IF(data!$P$41=2,EN!C11,IF(data!$P$41=4,FR!C11,IF(data!$P$41=3,DE!C11,IF(data!$P$41=5,NR!C11,IF(data!$P$41=6,SP!C11,IF(data!$P$41=7,SW!C11,IF(data!$P$41=8,TS!C11,IF(data!$P$41=9,ExtraTaal1!C11,IF(data!$P$41=10,ExtraTaal2!C11,IF(data!$P$41=11,ExtraTaal3!C11,)))))))))))","v":0},{"$f":"IF(data!$P$41=1,NL!D11,IF(data!$P$41=2,EN!D11,IF(data!$P$41=4,FR!D11,IF(data!$P$41=3,DE!D11,IF(data!$P$41=5,NR!D11,IF(data!$P$41=6,SP!D11,IF(data!$P$41=7,SW!D11,IF(data!$P$41=8,TS!D11,IF(data!$P$41=9,ExtraTaal1!D11,IF(data!$P$41=10,ExtraTaal2!D11,IF(data!$P$41=11,ExtraTaal3!D11,)))))))))))","v":0},20,{"$f":"F9","v":"°C"}]
[]
[]
[]
[null,{"$f":"IF(data!$P$41=1,NL!B3,IF(data!$P$41=2,EN!B3,IF(data!$P$41=4,FR!B3,IF(data!$P$41=3,DE!B3,IF(data!$P$41=5,NR!B3,IF(data!$P$41=6,SP!B3,IF(data!$P$41=7,SW!B3,IF(data!$P$41=8,TS!B3,IF(data!$P$41=9,ExtraTaal1!B3,IF(data!$P$41=10,ExtraTaal2!B3,IF(data!$P$41=11,ExtraTaal3!B3,)))))))))))&\" [cm]\"","v":"Longitud [cm]"},{"$f":"IF(data!$P$41=1,NL!B19,IF(data!$P$41=2,EN!B19,IF(data!$P$41=4,FR!B19,IF(data!$P$41=3,DE!B19,IF(data!$P$41=5,NR!B19,IF(data!$P$41=6,SP!B19,IF(data!$P$41=7,SW!B19,IF(data!$P$41=8,TS!B19,IF(data!$P$41=9,ExtraTaal1!B19,IF(data!$P$41=10,ExtraTaal2!B19,IF(data!$P$41=11,ExtraTaal3!B19,)))))))))))","v":" Voltaje control [V]"},{"$f":"IF(data!$P$41=1,NL!C14,IF(data!$P$41=2,EN!C14,IF(data!$P$41=4,FR!C14,IF(data!$P$41=3,DE!C14,IF(data!$P$41=5,NR!C14,IF(data!$P$41=6,SP!C14,IF(data!$P$41=7,SW!C14,IF(data!$P$41=8,TS!C14,IF(data!$P$41=9,ExtraTaal1!C14,IF(data!$P$41=10,ExtraTaal2!C14,IF(data!$P$41=11,ExtraTaal3!C14,)))))))))))&IF(data!$R$34=1,\" [W]\",IF(data!$R$34=2,\" [Btu/h]\",))","v":"Emisión calefacción [W]"},{"$f":"IF(data!$P$41=1,NL!D14,IF(data!$P$41=2,EN!D14,IF(data!$P$41=4,FR!D14,IF(data!$P$41=3,DE!D14,IF(data!$P$41=5,NR!D14,IF(data!$P$41=6,SP!D14,IF(data!$P$41=7,SW!D14,IF(data!$P$41=8,TS!D14,IF(data!$P$41=9,ExtraTaal1!D14,IF(data!$P$41=10,ExtraTaal2!D14,IF(data!$P$41=11,ExtraTaal3!D14,)))))))))))&IF(data!$R$34=1,\" [kg/u]\",IF(data!$R$34=2,\" [GPM]**\",))","v":"Caudal de agua, calefacción [kg/u]"},{"$f":"IF(data!$P$41=1,NL!F6,IF(data!$P$41=2,EN!F6,IF(data!$P$41=4,FR!F6,IF(data!$P$41=3,DE!F6,IF(data!$P$41=5,NR!F6,IF(data!$P$41=6,SP!F6,IF(data!$P$41=7,SW!F6,IF(data!$P$41=8,TS!F6,IF(data!$P$41=9,ExtraTaal1!F6,IF(data!$P$41=10,ExtraTaal2!F6,IF(data!$P$41=11,ExtraTaal3!F6,)))))))))))&\" [\"&IF(data!$R$34=1,\"kPa\",IF(data!$R$34=2,\"ftH2O\"))&\"]\"","v":"Pérdida de carga del agua [kPa]"},null,null,null,{"$f":"IF(data!$P$41=1,NL!I13,IF(data!$P$41=2,EN!I13,IF(data!$P$41=4,FR!I13,IF(data!$P$41=3,DE!I13,IF(data!$P$41=5,NR!I13,IF(data!$P$41=6,SP!I13,IF(data!$P$41=7,SW!I13,IF(data!$P$41=8,TS!I13,IF(data!$P$41=9,ExtraTaal1!I13,IF(data!$P$41=10,ExtraTaal2!I13,IF(data!$P$41=11,ExtraTaal3!I13,)))))))))))","v":"Presión sonora [dB(A)]****"},{"$f":"IF(data!$P$41=1,NL!J13,IF(data!$P$41=2,EN!J13,IF(data!$P$41=4,FR!J13,IF(data!$P$41=3,DE!J13,IF(data!$P$41=5,NR!J13,IF(data!$P$41=6,SP!J13,IF(data!$P$41=7,SW!J13,IF(data!$P$41=8,TS!J13,IF(data!$P$41=9,ExtraTaal1!J13,IF(data!$P$41=10,ExtraTaal2!J13,IF(data!$P$41=11,ExtraTaal3!J13,)))))))))))","v":"Potencia sonora [dB(A)]****"},{"$f":"IF(data!$P$41=1,NL!H13,IF(data!$P$41=2,EN!H13,IF(data!$P$41=4,FR!H13,IF(data!$P$41=3,DE!H13,IF(data!$P$41=5,NR!H13,IF(data!$P$41=6,SP!H13,IF(data!$P$41=7,SW!H13,IF(data!$P$41=8,TS!H13,IF(data!$P$41=9,ExtraTaal1!H13,IF(data!$P$41=10,ExtraTaal2!H13,IF(data!$P$41=11,ExtraTaal3!H13,)))))))))))","v":"Potencia eléctrica absorbida [W]"},{"$f":"IF(data!$P$41=1,NL!G13,IF(data!$P$41=2,EN!G13,IF(data!$P$41=4,FR!G13,IF(data!$P$41=3,DE!G13,IF(data!$P$41=5,NR!G13,IF(data!$P$41=6,SP!G13,IF(data!$P$41=7,SW!G13,IF(data!$P$41=8,TS!G13,IF(data!$P$41=9,ExtraTaal1!G13,IF(data!$P$41=10,ExtraTaal2!G13,IF(data!$P$41=11,ExtraTaal3!G13,)))))))))))&\" [l]\"","v":"Volumen de agua [l]"}]
[null,{"$f":"CONCATENATE(\"Micro Canal, \",J6, \" \",J5,\"cm, \",K6, \" \",K5,\"cm\")","v":"Micro Canal, Altura 6cm, Profund. 14cm"},0,0,0,0,0,0,0,0,0,0,0]
[null,60,24,{"$f":"ROUND(IF(data!$R$34=1,data!S5,IF(data!$R$34=2,data!S5*3.412141633,)),0)","v":390},{"$f":"IF(data!$R$34=1,ROUND(data!W5,0),IF(data!$R$34=2,ROUND(data!W5/272.7654,1),))","v":34},{"$f":"IF(data!$R$34=1,ROUND(data!Z5,2),IF(data!$R$34=2,ROUND(data!Z5*0.334552563,2),))","v":0.04},null,null,null,{"$f":"data!G5","v":18},{"$f":"J17+8","v":26},{"$f":"data!AQ5","v":1.6},{"$f":"data!$AP5","v":0.1}]
[null,95,24,{"$f":"ROUND(IF(data!$R$34=1,data!S6,IF(data!$R$34=2,data!S6*3.412141633,)),0)","v":780},{"$f":"IF(data!$R$34=1,ROUND(data!W6,0),IF(data!$R$34=2,ROUND(data!W6/272.7654,1),))","v":67},{"$f":"IF(data!$R$34=1,ROUND(data!Z6,2),IF(data!$R$34=2,ROUND(data!Z6*0.334552563,2),))","v":0.22},null,null,null,{"$f":"data!G6","v":21},{"$f":"J18+8","v":29},{"$f":"data!AQ6","v":1.9},{"$f":"data!$AP6","v":0.17}]
[null,130,24,{"$f":"ROUND(IF(data!$R$34=1,data!S7,IF(data!$R$34=2,data!S7*3.412141633,)),0)","v":1170},{"$f":"IF(data!$R$34=1,ROUND(data!W7,0),IF(data!$R$34=2,ROUND(data!W7/272.7654,1),))","v":101},{"$f":"IF(data!$R$34=1,ROUND(data!Z7,2),IF(data!$R$34=2,ROUND(data!Z7*0.334552563,2),))","v":0.65},null,null,null,{"$f":"data!G7","v":22.8},{"$f":"J19+8","v":30.8},{"$f":"data!AQ7","v":2.2000000000000002},{"$f":"data!$AP7","v":0.25}]
[null,165,24,{"$f":"ROUND(IF(data!$R$34=1,data!S8,IF(data!$R$34=2,data!S8*3.412141633,)),0)","v":1560},{"$f":"IF(data!$R$34=1,ROUND(data!W8,0),IF(data!$R$34=2,ROUND(data!W8/272.7654,1),))","v":134},{"$f":"IF(data!$R$34=1,ROUND(data!Z8,2),IF(data!$R$34=2,ROUND(data!Z8*0.334552563,2),))","v":1.39},null,null,null,{"$f":"data!G8","v":24},{"$f":"J20+8","v":32},{"$f":"data!AQ8","v":3.1},{"$f":"data!$AP8","v":0.32}]
[null,200,{"$f":"data!AV9","v":24},{"$f":"ROUND(IF(data!$R$34=1,data!S9,IF(data!$R$34=2,data!S9*3.412141633,)),0)","v":1950},{"$f":"IF(data!$R$34=1,ROUND(data!W9,0),IF(data!$R$34=2,ROUND(data!W9/272.7654,1),))","v":168},{"$f":"IF(data!$R$34=1,ROUND(data!Z9,2),IF(data!$R$34=2,ROUND(data!Z9*0.334552563,2),))","v":2.57},null,null,null,{"$f":"data!G9","v":25},{"$f":"J21+8","v":33},{"$f":"data!AQ9","v":3.5},{"$f":"data!$AP9","v":0.4}]
[null,"*",{"$f":"IF(data!$P$41=1,NL!B20,IF(data!$P$41=2,EN!B20,IF(data!$P$41=4,FR!B20,IF(data!$P$41=3,DE!B20,IF(data!$P$41=5,NR!B20,IF(data!$P$41=6,SP!B20,IF(data!$P$41=7,SW!B20,IF(data!$P$41=8,TS!B20,IF(data!$P$41=9,ExtraTaal1!B20,IF(data!$P$41=10,ExtraTaal2!B20,IF(data!$P$41=11,ExtraTaal3!B20,)))))))))))","v":"La potencia de enfriamiento se calcula según la norma EN 16430 con ventiladores de todas las alturas."},null,null,null,null,null,null,null,null,null,"v2021-04-19"]
[null,"***",{"$f":"IF(data!$P$41=1,NL!B22,IF(data!$P$41=2,EN!B22,IF(data!$P$41=4,FR!B22,IF(data!$P$41=3,DE!B22,IF(data!$P$41=5,NR!B22,IF(data!$P$41=6,SP!B22,IF(data!$P$41=7,SW!B22,IF(data!$P$41=8,TS!B22,IF(data!$P$41=9,ExtraTaal1!B22,IF(data!$P$41=10,ExtraTaal2!B22,IF(data!$P$41=11,ExtraTaal3!B22,)))))))))))","v":"Potencia sonora según ISO 3741: 2010, nivel de presión acústica con una amortiguación ambiental supuesta de 8 dB (A)."},{"$f":"IF(data!$P$41=1,NL!C21,IF(data!$P$41=2,EN!C21,IF(data!$P$41=4,FR!C21,IF(data!$P$41=3,DE!C21,IF(data!$P$41=5,NR!C21,IF(data!$P$41=6,SP!C21,IF(data!$P$41=7,SW!C21,IF(data!$P$41=8,TS!C21,IF(data!$P$41=9,ExtraTaal1!C21,IF(data!$P$41=10,ExtraTaal2!C21,IF(data!$P$41=11,ExtraTaal3!C21,)))))))))))","v":0},{"$f":"IF(data!$P$41=1,NL!D21,IF(data!$P$41=2,EN!D21,IF(data!$P$41=4,FR!D21,IF(data!$P$41=3,DE!D21,IF(data!$P$41=5,NR!D21,IF(data!$P$41=6,SP!D21,IF(data!$P$41=7,SW!D21,IF(data!$P$41=8,TS!D21,IF(data!$P$41=9,ExtraTaal1!D21,IF(data!$P$41=10,ExtraTaal2!D21,IF(data!$P$41=11,ExtraTaal3!D21,)))))))))))","v":0},{"$f":"IF(data!$P$41=1,NL!E21,IF(data!$P$41=2,EN!E21,IF(data!$P$41=4,FR!E21,IF(data!$P$41=3,DE!E21,IF(data!$P$41=5,NR!E21,IF(data!$P$41=6,SP!E21,IF(data!$P$41=7,SW!E21,IF(data!$P$41=8,TS!E21,IF(data!$P$41=9,ExtraTaal1!E21,IF(data!$P$41=10,ExtraTaal2!E21,IF(data!$P$41=11,ExtraTaal3!E21,)))))))))))","v":0},{"$f":"IF(data!$P$41=1,NL!F21,IF(data!$P$41=2,EN!F21,IF(data!$P$41=4,FR!F21,IF(data!$P$41=3,DE!F21,IF(data!$P$41=5,NR!F21,IF(data!$P$41=6,SP!F21,IF(data!$P$41=7,SW!F21,IF(data!$P$41=8,TS!F21,IF(data!$P$41=9,ExtraTaal1!F21,IF(data!$P$41=10,ExtraTaal2!F21,IF(data!$P$41=11,ExtraTaal3!F21,)))))))))))","v":0},{"$f":"IF(data!$P$41=1,NL!G21,IF(data!$P$41=2,EN!G21,IF(data!$P$41=4,FR!G21,IF(data!$P$41=3,DE!G21,IF(data!$P$41=5,NR!G21,IF(data!$P$41=6,SP!G21,IF(data!$P$41=7,SW!G21,IF(data!$P$41=8,TS!G21,IF(data!$P$41=9,ExtraTaal1!G21,IF(data!$P$41=10,ExtraTaal2!G21,IF(data!$P$41=11,ExtraTaal3!G21,)))))))))))","v":0},{"$f":"IF(data!$P$41=1,NL!H21,IF(data!$P$41=2,EN!H21,IF(data!$P$41=4,FR!H21,IF(data!$P$41=3,DE!H21,IF(data!$P$41=5,NR!H21,IF(data!$P$41=6,SP!H21,IF(data!$P$41=7,SW!H21,IF(data!$P$41=8,TS!H21,IF(data!$P$41=9,ExtraTaal1!H21,IF(data!$P$41=10,ExtraTaal2!H21,IF(data!$P$41=11,ExtraTaal3!H21,)))))))))))","v":0},{"$f":"IF(data!$P$41=1,NL!I21,IF(data!$P$41=2,EN!I21,IF(data!$P$41=4,FR!I21,IF(data!$P$41=3,DE!I21,IF(data!$P$41=5,NR!I21,IF(data!$P$41=6,SP!I21,IF(data!$P$41=7,SW!I21,IF(data!$P$41=8,TS!I21,IF(data!$P$41=9,ExtraTaal1!I21,IF(data!$P$41=10,ExtraTaal2!I21,IF(data!$P$41=11,ExtraTaal3!I21,)))))))))))","v":0},{"$f":"IF(data!$P$41=1,NL!J21,IF(data!$P$41=2,EN!J21,IF(data!$P$41=4,FR!J21,IF(data!$P$41=3,DE!J21,IF(data!$P$41=5,NR!J21,IF(data!$P$41=6,SP!J21,IF(data!$P$41=7,SW!J21,IF(data!$P$41=8,TS!J21,IF(data!$P$41=9,ExtraTaal1!J21,IF(data!$P$41=10,ExtraTaal2!J21,IF(data!$P$41=11,ExtraTaal3!J21,)))))))))))","v":0},{"$f":"IF(data!$P$41=1,NL!K21,IF(data!$P$41=2,EN!K21,IF(data!$P$41=4,FR!K21,IF(data!$P$41=3,DE!K21,IF(data!$P$41=5,NR!K21,IF(data!$P$41=6,SP!K21,IF(data!$P$41=7,SW!K21,IF(data!$P$41=8,TS!K21,IF(data!$P$41=9,ExtraTaal1!K21,IF(data!$P$41=10,ExtraTaal2!K21,IF(data!$P$41=11,ExtraTaal3!K21,)))))))))))","v":0},{"$f":"IF(data!$P$41=1,NL!L21,IF(data!$P$41=2,EN!L21,IF(data!$P$41=4,FR!L21,IF(data!$P$41=3,DE!L21,IF(data!$P$41=5,NR!L21,IF(data!$P$41=6,SP!L21,IF(data!$P$41=7,SW!L21,IF(data!$P$41=8,TS!L21,IF(data!$P$41=9,ExtraTaal1!L21,IF(data!$P$41=10,ExtraTaal2!L21,IF(data!$P$41=11,ExtraTaal3!L21,)))))))))))","v":0}]
[null,null,{"$f":"IF(data!$P$41=1,NL!B22,IF(data!$P$41=2,EN!B22,IF(data!$P$41=4,FR!B22,IF(data!$P$41=3,DE!B22,IF(data!$P$41=5,NR!B22,IF(data!$P$41=6,SP!B22,IF(data!$P$41=7,SW!B22,IF(data!$P$41=8,TS!B22,IF(data!$P$41=9,ExtraTaal1!B22,IF(data!$P$41=10,ExtraTaal2!B22,IF(data!$P$41=11,ExtraTaal3!B22,)))))))))))","v":"Potencia sonora según ISO 3741: 2010, nivel de presión acústica con una amortiguación ambiental supuesta de 8 dB (A)."},{"$f":"IF(data!$P$41=1,NL!C22,IF(data!$P$41=2,EN!C22,IF(data!$P$41=4,FR!C22,IF(data!$P$41=3,DE!C22,IF(data!$P$41=5,NR!C22,IF(data!$P$41=6,SP!C22,IF(data!$P$41=7,SW!C22,IF(data!$P$41=8,TS!C22,IF(data!$P$41=9,ExtraTaal1!C22,IF(data!$P$41=10,ExtraTaal2!C22,IF(data!$P$41=11,ExtraTaal3!C22,)))))))))))","v":0},{"$f":"IF(data!$P$41=1,NL!D22,IF(data!$P$41=2,EN!D22,IF(data!$P$41=4,FR!D22,IF(data!$P$41=3,DE!D22,IF(data!$P$41=5,NR!D22,IF(data!$P$41=6,SP!D22,IF(data!$P$41=7,SW!D22,IF(data!$P$41=8,TS!D22,IF(data!$P$41=9,ExtraTaal1!D22,IF(data!$P$41=10,ExtraTaal2!D22,IF(data!$P$41=11,ExtraTaal3!D22,)))))))))))","v":0},{"$f":"IF(data!$P$41=1,NL!E22,IF(data!$P$41=2,EN!E22,IF(data!$P$41=4,FR!E22,IF(data!$P$41=3,DE!E22,IF(data!$P$41=5,NR!E22,IF(data!$P$41=6,SP!E22,IF(data!$P$41=7,SW!E22,IF(data!$P$41=8,TS!E22,IF(data!$P$41=9,ExtraTaal1!E22,IF(data!$P$41=10,ExtraTaal2!E22,IF(data!$P$41=11,ExtraTaal3!E22,)))))))))))","v":0},{"$f":"IF(data!$P$41=1,NL!F22,IF(data!$P$41=2,EN!F22,IF(data!$P$41=4,FR!F22,IF(data!$P$41=3,DE!F22,IF(data!$P$41=5,NR!F22,IF(data!$P$41=6,SP!F22,IF(data!$P$41=7,SW!F22,IF(data!$P$41=8,TS!F22,IF(data!$P$41=9,ExtraTaal1!F22,IF(data!$P$41=10,ExtraTaal2!F22,IF(data!$P$41=11,ExtraTaal3!F22,)))))))))))","v":0},{"$f":"IF(data!$P$41=1,NL!G22,IF(data!$P$41=2,EN!G22,IF(data!$P$41=4,FR!G22,IF(data!$P$41=3,DE!G22,IF(data!$P$41=5,NR!G22,IF(data!$P$41=6,SP!G22,IF(data!$P$41=7,SW!G22,IF(data!$P$41=8,TS!G22,IF(data!$P$41=9,ExtraTaal1!G22,IF(data!$P$41=10,ExtraTaal2!G22,IF(data!$P$41=11,ExtraTaal3!G22,)))))))))))","v":0},{"$f":"IF(data!$P$41=1,NL!H22,IF(data!$P$41=2,EN!H22,IF(data!$P$41=4,FR!H22,IF(data!$P$41=3,DE!H22,IF(data!$P$41=5,NR!H22,IF(data!$P$41=6,SP!H22,IF(data!$P$41=7,SW!H22,IF(data!$P$41=8,TS!H22,IF(data!$P$41=9,ExtraTaal1!H22,IF(data!$P$41=10,ExtraTaal2!H22,IF(data!$P$41=11,ExtraTaal3!H22,)))))))))))","v":0},{"$f":"IF(data!$P$41=1,NL!I22,IF(data!$P$41=2,EN!I22,IF(data!$P$41=4,FR!I22,IF(data!$P$41=3,DE!I22,IF(data!$P$41=5,NR!I22,IF(data!$P$41=6,SP!I22,IF(data!$P$41=7,SW!I22,IF(data!$P$41=8,TS!I22,IF(data!$P$41=9,ExtraTaal1!I22,IF(data!$P$41=10,ExtraTaal2!I22,IF(data!$P$41=11,ExtraTaal3!I22,)))))))))))","v":0},{"$f":"IF(data!$P$41=1,NL!J22,IF(data!$P$41=2,EN!J22,IF(data!$P$41=4,FR!J22,IF(data!$P$41=3,DE!J22,IF(data!$P$41=5,NR!J22,IF(data!$P$41=6,SP!J22,IF(data!$P$41=7,SW!J22,IF(data!$P$41=8,TS!J22,IF(data!$P$41=9,ExtraTaal1!J22,IF(data!$P$41=10,ExtraTaal2!J22,IF(data!$P$41=11,ExtraTaal3!J22,)))))))))))","v":0},{"$f":"IF(data!$P$41=1,NL!K22,IF(data!$P$41=2,EN!K22,IF(data!$P$41=4,FR!K22,IF(data!$P$41=3,DE!K22,IF(data!$P$41=5,NR!K22,IF(data!$P$41=6,SP!K22,IF(data!$P$41=7,SW!K22,IF(data!$P$41=8,TS!K22,IF(data!$P$41=9,ExtraTaal1!K22,IF(data!$P$41=10,ExtraTaal2!K22,IF(data!$P$41=11,ExtraTaal3!K22,)))))))))))","v":0},{"$f":"IF(data!$P$41=1,NL!L22,IF(data!$P$41=2,EN!L22,IF(data!$P$41=4,FR!L22,IF(data!$P$41=3,DE!L22,IF(data!$P$41=5,NR!L22,IF(data!$P$41=6,SP!L22,IF(data!$P$41=7,SW!L22,IF(data!$P$41=8,TS!L22,IF(data!$P$41=9,ExtraTaal1!L22,IF(data!$P$41=10,ExtraTaal2!L22,IF(data!$P$41=11,ExtraTaal3!L22,)))))))))))","v":0}]

{"sheet":"data","index":1,"n_rows":41,"n_cols":62,"rows_kept":41,"cut":false,"hidden":true,"merged":[[10,51,10,53],[10,54,10,56],[10,58,10,60],[10,61,10,62]]}
[null,null,null,null,null,null,null,null,null,"heating","Ti",{"$f":"IF($R$34=1,$M1,IF($R$34=2,(M1-32)/1.8,))","v":75},{"$f":"'Micro Canal'!E9","v":75},null,null,null,null,null,null,null,null,null,null,null,null,null,null,null,null,"cooling","Ti",{"$f":"IF($R$34=1,$AG1,IF($R$34=2,($AG1-32)/1.8,))","v":0},{"$f":"'Micro Canal'!J9","v":0},null,"RH",{"$f":"'Micro Canal'!J12","v":0}]
[null,null,null,null,null,null,null,null,null,null,"Tr",{"$f":"IF($R$34=1,$M2,IF($R$34=2,(M2-32)/1.8,))","v":65},{"$f":"'Micro Canal'!E10","v":65},null,null,null,null,null,null,null,null,null,null,null,null,null,null,null,null,null,"Tr",{"$f":"IF($R$34=1,$AG2,IF($R$34=2,($AG2-32)/1.8,))","v":0},{"$f":"'Micro Canal'!J10","v":0}]
[null,null,null,null,null,null,null,null,null,null,"Ta",{"$f":"IF($R$34=1,$M3,IF($R$34=2,(M3-32)/1.8,))","v":20},{"$f":"'Micro Canal'!E11","v":20},null,null,null,null,null,null,null,null,null,null,null,null,null,null,null,null,null,"Ta",{"$f":"IF($R$34=1,$AG3,IF($R$34=2,($AG3-32)/1.8,))","v":0},{"$f":"'Micro Canal'!J11","v":0}]
["kolomindex",2,3,4,5,6,7,8,9,10,11,12,13,14,15,16,17,18,19,20,21,22,23,24,25,26,27,28,29,30,31,32,33,34,35,36,37,38,39,40,41,42,43,44,45,46,47,48,49,50,51,52,53,54,55,56,57,58,59,60,61,62]
[{"$f":"CONCATENATE('Micro Canal'!$J$5,60,'Micro Canal'!$K$5)","v":"66014"},{"$f":"VLOOKUP($A5,$A$13:$BJ$17,B$4,0)","v":6},60,0,14,0,18,0,0,0,390,0,0,0,1,0,0,{"$f":"VLOOKUP($A5,$A$13:$BJ$17,R$4,0)","v":0},390,0,0,0,34,0,0,3.6728306720280143E-2,6.5250871001174002E-3,5.7852740858429998E-4,1.8056661148752,0,0,0,0,{"$f":"VLOOKUP($A5,$A$13:$BJ$17,AH$4,0)","v":0},0,{"$error":"#DIV/0!"},{"$error":"#DIV/0!"},{"$error":"#DIV/0!"},{"$error":"#DIV/0!"},{"$error":"#DIV/0!"},{"$error":"#DIV/0!"},0.1,1.6,"N/A","N/A",0,0,24,"N/A",{"$f":"VLOOKUP($A5,$A$13:$BJ$17,AX$4,0)","v":"N/A"},0,{"$error":"#DIV/0!"},{"$error":"#DIV/0!"},{"$error":"#DIV/0!"},{"$error":"#DIV/0!"},{"$error":"#DIV/0!"},{"$error":"#DIV/0!"},0,{"$error":"#DIV/0!"},{"$error":"#DIV/0!"},{"$error":"#DIV/0!"},{"$error":"#DIV/0!"}]
[{"$f":"CONCATENATE('Micro Canal'!$J$5,95,'Micro Canal'!$K$5)","v":"69514"},6,95,0,14,0,21,0,0,0,780,0,0,0,1,0,0,0,780,0,0,0,67,0,0,0.21690746472881234,6.5250871001174002E-3,5.7852740858429998E-4,1.8056661148752,0,0,0,0,0,0,{"$error":"#DIV/0!"},{"$error":"#DIV/0!"},{"$error":"#DIV/0!"},{"$error":"#DIV/0!"},{"$error":"#DIV/0!"},{"$error":"#DIV/0!"},0.17,1.9,"N/A","N/A",0,0,24,"N/A","N/A",0,{"$error":"#DIV/0!"},{"$error":"#DIV/0!"},{"$error":"#DIV/0!"},{"$error":"#DIV/0!"},{"$error":"#DIV/0!"},{"$error":"#DIV/0!"},0,{"$error":"#DIV/0!"},{"$error":"#DIV/0!"},{"$error":"#DIV/0!"},{"$error":"#DIV/0!"}]
[{"$f":"CONCATENATE('Micro Canal'!$J$5,130,'Micro Canal'!$K$5)","v":"613014"},6,130,0,14,0,22.8,0,0,0,1170,0,0,0,1,0,0,0,1170,0,0,0,101,0,0,0.6457845326749978,6.5250871001174002E-3,5.7852740858429998E-4,1.8056661148752,0,0,0,0,0,0,{"$error":"#DIV/0!"},{"$error":"#DIV/0!"},{"$error":"#DIV/0!"},{"$error":"#DIV/0!"},{"$error":"#DIV/0!"},{"$error":"#DIV/0!"},0.25,2.2000000000000002,"N/A","N/A",0,0,24,"N/A","N/A",0,{"$error":"#DIV/0!"},{"$error":"#DIV/0!"},{"$error":"#DIV/0!"},{"$error":"#DIV/0!"},{"$error":"#DIV/0!"},{"$error":"#DIV/0!"},0,{"$error":"#DIV/0!"},{"$error":"#DIV/0!"},{"$error":"#DIV/0!"},{"$error":"#DIV/0!"}]
[{"$f":"CONCATENATE('Micro Canal'!$J$5,165,'Micro Canal'!$K$5)","v":"616514"},6,165,0,14,0,24,0,0,0,1560,0,0,0,1,0,0,0,1560,0,0,0,134,0,0,1.3916742384383558,6.5250871001174002E-3,5.7852740858429998E-4,1.8056661148752,0,0,0,0,0,0,{"$error":"#DIV/0!"},{"$error":"#DIV/0!"},{"$error":"#DIV/0!"},{"$error":"#DIV/0!"},{"$error":"#DIV/0!"},{"$error":"#DIV/0!"},0.32,3.1,"N/A","N/A",0,0,24,"N/A","N/A",0,{"$error":"#DIV/0!"},{"$error":"#DIV/0!"},{"$error":"#DIV/0!"},{"$error":"#DIV/0!"},{"$error":"#DIV/0!"},{"$error":"#DIV/0!"},0,{"$error":"#DIV/0!"},{"$error":"#DIV/0!"},{"$error":"#DIV/0!"},{"$error":"#DIV/0!"}]
[{"$f":"CONCATENATE('Micro Canal'!$J$5,200,'Micro Canal'!$K$5)","v":"620014"},{"$f":"VLOOKUP($A9,$A$13:$BJ$17,B$4,0)","v":6},{"$f":"VLOOKUP($A9,$A$13:$BJ$17,C$4,0)","v":200},0,14,0,25,0,0,0,1950,0,0,0,1,0,0,0,1950,0,0,0,168,0,0,2.567068149734359,6.5250871001174002E-3,5.7852740858429998E-4,1.8056661148752,0,0,0,0,0,0,{"$error":"#DIV/0!"},{"$error":"#DIV/0!"},{"$error":"#DIV/0!"},{"$error":"#DIV/0!"},{"$error":"#DIV/0!"},{"$error":"#DIV/0!"},0.4,3.5,"N/A","N/A",0,0,24,"N/A","N/A",0,{"$error":"#DIV/0!"},{"$error":"#DIV/0!"},{"$error":"#DIV/0!"},{"$error":"#DIV/0!"},{"$error":"#DIV/0!"},{"$error":"#DIV/0!"},0,{"$error":"#DIV/0!"},{"$error":"#DIV/0!"},{"$error":"#DIV/0!"},{"$error":"#DIV/0!"}]
[]
[null,null,null,null,null,"soundpressure level",null,null,null,"power","75/65/20",null,null,"n",null,null,null,"result","power",null,null,"result","flow",null,null,"Pressure loss",null,null,null,"power","16/18/27",null,"n",null,null,"result","power",null,"result","flow",null,null,"electrical power nominal",null,null,null,null,null,"BMS-stuurspanning",null,null,"Sensible heat factor",null,null,"Total cooling capacity",null,null,null,"Diff. Total and sensible",null,null,"Show or not"]
["lookup code","height","length","type","depth",0,1,2,3,0,1,2,3,0,1,2,3,0,1,2,3,0,1,2,3,"Δp","k1","k2","n",1,2,3,1,2,3,1,2,3,1,2,3,"watervolume",1,2,3,null,0,1,2,3,null,"SHF 1","SHF 2","SHF 3","Q,t 1","Q,t 2","Q,t 3",null,"ΔQ,t,s 1","ΔQ,t,s 2","ΔQ,t,s 3","OK/NOTOK"]
[{"$f":"CONCATENATE(B13,C13,E13)","v":"66014"},6,60,null,14,null,18,null,null,null,390,null,null,null,1,null,null,{"$f":"ROUND(J13*POWER((($L$1-$L$2)/LN(($L$1-$L$3)/($L$2-$L$3)))/((75-65)/LN((75-20)/(65-20))),N13),0)","v":0},{"$f":"ROUND(K13*POWER((($L$1-$L$2)/LN(($L$1-$L$3)/($L$2-$L$3)))/((75-65)/LN((75-20)/(65-20))),O13),0)","v":390},{"$f":"ROUND(L13*POWER((($L$1-$L$2)/LN(($L$1-$L$3)/($L$2-$L$3)))/((75-65)/LN((75-20)/(65-20))),P13),0)","v":0},{"$f":"ROUND(M13*POWER((($L$1-$L$2)/LN(($L$1-$L$3)/($L$2-$L$3)))/((75-65)/LN((75-20)/(65-20))),Q13),0)","v":0},{"$f":"ROUND(R13*3600/(4186*ABS($L$1-$L$2)),0)","v":0},{"$f":"ROUND(S13*3600/(4186*ABS($L$1-$L$2)),0)","v":34},{"$f":"ROUND(T13*3600/(4186*ABS($L$1-$L$2)),0)","v":0},{"$f":"ROUND(U13*3600/(4186*ABS($L$1-$L$2)),0)","v":0},{"$f":"(($AA13*($W13^$AC13)*(($C13-19.5)/100)*2)+$AB13*($W13^2))*0.0098","v":3.6728306720280143E-2},6.5250871001174002E-3,5.7852740858429998E-4,1.8056661148752,null,null,null,null,null,null,{"$f":"ROUND(AD13*POWER((($AF$1-$AF$2)/LN(($AF$1-$AF$3)/($AF$2-$AF$3)))/((16-18)/LN((16-27)/(18-27))),AG13),0)","v":{"$error":"#DIV/0!"}},{"$error":"#DIV/0!"},{"$f":"ROUND(AF13*POWER((($AF$1-$AF$2)/LN(($AF$1-$AF$3)/($AF$2-$AF$3)))/((16-18)/LN((16-27)/(18-27))),AI13),0)","v":{"$error":"#DIV/0!"}},{"$f":"ROUND(AJ13*3600/(4186*ABS($AF$1-$AF$2)),0)","v":{"$error":"#DIV/0!"}},{"$f":"ROUND(AK13*3600/(4186*ABS($AF$1-$AF$2)),0)","v":{"$error":"#DIV/0!"}},{"$f":"ROUND(AL13*3600/(4186*ABS($AF$1-$AF$2)),0)","v":{"$error":"#DIV/0!"}},0.1,1.6,"N/A","N/A",null,0,24,"N/A","N/A",null,{"$f":"IF(1/(1+((2258*((0.622/((101325/(1*611*EXP(17.27*((($AF$1+$AF$2)/2)/((($AF$1+$AF$2)/2)+237.3))))))-1)*1000-(0.622/((101325/($AJ$1*611*EXP(17.27*($AF$3/($AF$3+237.3))))))-1)*1000))/(1005*((($AF$1+$AF$2)/2)-$AF$3))))>1,1,1/(1+((2258*((0.622/((101325/(1*611*EXP(17.27*((($AF$1+$AF$2)/2)/((($AF$1+$AF$2)/2)+237.3))))))-1)*1000-(0.622/((101325/($AJ$1*611*EXP(17.27*($AF$3/($AF$3+237.3))))))-1)*1000))/(1005*((($AF$1+$AF$2)/2)-$AF$3)))))","v":{"$error":"#DIV/0!"}},{"$f":"IF(1/(1+((2258*((0.622/((101325/(1*611*EXP(17.27*((($AF$1+$AF$2)/2)/((($AF$1+$AF$2)/2)+237.3))))))-1)*1000-(0.622/((101325/($AJ$1*611*EXP(17.27*($AF$3/($AF$3+237.3))))))-1)*1000))/(1005*((($AF$1+$AF$2)/2)-$AF$3))))>1,1,1/(1+((2258*((0.622/((101325/(1*611*EXP(17.27*((($AF$1+$AF$2)/2)/((($AF$1+$AF$2)/2)+237.3))))))-1)*1000-(0.622/((101325/($AJ$1*611*EXP(17.27*($AF$3/($AF$3+237.3))))))-1)*1000))/(1005*((($AF$1+$AF$2)/2)-$AF$3)))))","v":{"$error":"#DIV/0!"}},{"$f":"IF(1/(1+((2258*((0.622/((101325/(1*611*EXP(17.27*((($AF$1+$AF$2)/2)/((($AF$1+$AF$2)/2)+237.3))))))-1)*1000-(0.622/((101325/($AJ$1*611*EXP(17.27*($AF$3/($AF$3+237.3))))))-1)*1000))/(1005*((($AF$1+$AF$2)/2)-$AF$3))))>1,1,1/(1+((2258*((0.622/((101325/(1*611*EXP(17.27*((($AF$1+$AF$2)/2)/((($AF$1+$AF$2)/2)+237.3))))))-1)*1000-(0.622/((101325/($AJ$1*611*EXP(17.27*($AF$3/($AF$3+237.3))))))-1)*1000))/(1005*((($AF$1+$AF$2)/2)-$AF$3)))))","v":{"$error":"#DIV/0!"}},{"$f":"AJ13/AZ13","v":{"$error":"#DIV/0!"}},{"$error":"#DIV/0!"},{"$error":"#DIV/0!"},null,{"$f":"BC13-AJ13","v":{"$error":"#DIV/0!"}},{"$error":"#DIV/0!"},{"$error":"#DIV/0!"},{"$f":"IF(SUM(BG13:BI13)=0,1,0)","v":{"$error":"#DIV/0!"}}]
[{"$f":"CONCATENATE(B14,C14,E14)","v":"69514"},6,95,null,14,null,21,null,null,null,780,null,null,null,1,null,null,0,780,0,0,0,67,0,0,{"$f":"(($AA14*($W14^$AC14)*(($C14-19.5)/100)*2)+$AB14*($W14^2))*0.0098","v":0.21690746472881234},6.5250871001174002E-3,5.7852740858429998E-4,1.8056661148752,null,null,null,null,null,null,{"$error":"#DIV/0!"},{"$error":"#DIV/0!"},{"$f":"ROUND(AF14*POWER((($AF$1-$AF$2)/LN(($AF$1-$AF$3)/($AF$2-$AF$3)))/((16-18)/LN((16-27)/(18-27))),AI14),0)","v":{"$error":"#DIV/0!"}},{"$error":"#DIV/0!"},{"$error":"#DIV/0!"},{"$error":"#DIV/0!"},0.17,1.9,"N/A","N/A",null,0,24,"N/A","N/A",null,{"$f":"IF(1/(1+((2258*((0.622/((101325/(1*611*EXP(17.27*((($AF$1+$AF$2)/2)/((($AF$1+$AF$2)/2)+237.3))))))-1)*1000-(0.622/((101325/($AJ$1*611*EXP(17.27*($AF$3/($AF$3+237.3))))))-1)*1000))/(1005*((($AF$1+$AF$2)/2)-$AF$3))))>1,1,1/(1+((2258*((0.622/((101325/(1*611*EXP(17.27*((($AF$1+$AF$2)/2)/((($AF$1+$AF$2)/2)+237.3))))))-1)*1000-(0.622/((101325/($AJ$1*611*EXP(17.27*($AF$3/($AF$3+237.3))))))-1)*1000))/(1005*((($AF$1+$AF$2)/2)-$AF$3)))))","v":{"$error":"#DIV/0!"}},{"$error":"#DIV/0!"},{"$error":"#DIV/0!"},{"$error":"#DIV/0!"},{"$error":"#DIV/0!"},{"$error":"#DIV/0!"},null,{"$error":"#DIV/0!"},{"$error":"#DIV/0!"},{"$error":"#DIV/0!"},{"$f":"IF(SUM(BG14:BI14)=0,1,0)","v":{"$error":"#DIV/0!"}}]
["613014",6,130,null,14,null,22.8,null,null,null,1170,null,null,null,1,null,null,0,1170,0,0,0,101,0,0,0.6457845326749978,6.5250871001174002E-3,5.7852740858429998E-4,1.8056661148752,null,null,null,null,null,null,{"$error":"#DIV/0!"},{"$error":"#DIV/0!"},{"$error":"#DIV/0!"},{"$error":"#DIV/0!"},{"$error":"#DIV/0!"},{"$error":"#DIV/0!"},0.25,2.2000000000000002,"N/A","N/A",null,0,24,"N/A","N/A",null,{"$error":"#DIV/0!"},{"$error":"#DIV/0!"},{"$error":"#DIV/0!"},{"$error":"#DIV/0!"},{"$error":"#DIV/0!"},{"$error":"#DIV/0!"},null,{"$error":"#DIV/0!"},{"$error":"#DIV/0!"},{"$error":"#DIV/0!"},{"$error":"#DIV/0!"}]
["616514",6,165,null,14,null,24,null,null,null,1560,null,null,null,1,null,null,0,1560,0,{"$f":"ROUND(M16*POWER((($L$1-$L$2)/LN(($L$1-$L$3)/($L$2-$L$3)))/((75-65)/LN((75-20)/(65-20))),Q16),0)","v":0},0,134,0,0,1.3916742384383558,6.5250871001174002E-3,5.7852740858429998E-4,1.8056661148752,null,null,null,null,null,null,{"$error":"#DIV/0!"},{"$error":"#DIV/0!"},{"$error":"#DIV/0!"},{"$error":"#DIV/0!"},{"$error":"#DIV/0!"},{"$error":"#DIV/0!"},0.32,3.1,"N/A","N/A",null,0,24,"N/A","N/A",null,{"$error":"#DIV/0!"},{"$error":"#DIV/0!"},{"$error":"#DIV/0!"},{"$error":"#DIV/0!"},{"$error":"#DIV/0!"},{"$error":"#DIV/0!"},null,{"$error":"#DIV/0!"},{"$error":"#DIV/0!"},{"$error":"#DIV/0!"},{"$error":"#DIV/0!"}]
["620014",6,200,null,14,null,25,null,null,null,1950,null,null,null,1,null,null,0,1950,0,0,0,168,0,0,2.567068149734359,6.5250871001174002E-3,5.7852740858429998E-4,1.8056661148752,null,null,null,null,null,null,{"$error":"#DIV/0!"},{"$error":"#DIV/0!"},{"$error":"#DIV/0!"},{"$error":"#DIV/0!"},{"$error":"#DIV/0!"},{"$error":"#DIV/0!"},0.4,3.5,"N/A","N/A",null,0,24,"N/A","N/A",null,{"$error":"#DIV/0!"},{"$error":"#DIV/0!"},{"$error":"#DIV/0!"},{"$error":"#DIV/0!"},{"$error":"#DIV/0!"},{"$error":"#DIV/0!"},null,{"$error":"#DIV/0!"},{"$error":"#DIV/0!"},{"$error":"#DIV/0!"},{"$error":"#DIV/0!"}]
[]
[]
[]
[null,null,null,null,null,null,null,null,null,null,null,"lengte","hoogte","width"]
[null,null,null,null,null,null,null,null,null,null,"geselecteerd"]
[null,null,null,null,null,null,null,null,null,null,null,60,6,14]
[null,null,null,null,null,null,null,null,null,null,null,95]
[null,null,null,null,null,null,null,null,null,null,null,130]
[null,null,null,null,null,null,null,null,null,null,null,165]
[null,null,null,null,null,null,null,null,null,null,null,200]
[]
[]
[null,null,null,null,null,null,null,null,null,null,null,null,null,{"$f":"IF($P$41=1,NL!I3,IF($P$41=2,EN!I3,IF($P$41=3,DE!I3,IF($P$41=4,FR!I3,IF($P$41=5,NR!I3,IF($P$41=6,SP!I3,IF($P$41=7,SW!I3,IF($P$41=8,TS!I3,IF($P$41=9,ExtraTaal1!I3,IF($P$41=10,ExtraTaal2!I3,IF($P$41=11,ExtraTaal3!I3,)))))))))))","v":"Copiar todos los datos"},null,"Nederlands"]
[null,null,null,null,null,null,null,null,null,null,null,null,null,{"$f":"IF($P$41=1,NL!I4,IF($P$41=2,EN!I4,IF($P$41=3,DE!I4,IF($P$41=4,FR!I4,IF($P$41=5,NR!I4,IF($P$41=6,SP!I4,IF($P$41=7,SW!I4,IF($P$41=8,TS!I4,IF($P$41=9,ExtraTaal1!I4,IF($P$41=10,ExtraTaal2!I4,IF($P$41=11,ExtraTaal3!I4,)))))))))))","v":"Unidades-SI"},null,"English"]
[null,null,null,null,null,null,null,null,null,null,null,null,null,{"$f":"IF($P$41=1,NL!I5,IF($P$41=2,EN!I5,IF($P$41=3,DE!I5,IF($P$41=4,FR!I5,IF($P$41=5,NR!I5,IF($P$41=6,SP!I5,IF($P$41=7,SW!I5,IF($P$41=8,TS!I5,IF($P$41=9,ExtraTaal1!I5,IF($P$41=10,ExtraTaal2!I5,IF($P$41=11,ExtraTaal3!I5,)))))))))))","v":"Unidades-Imperial"},null,"Français"]
[null,null,null,null,null,null,null,null,null,null,null,null,null,null,null,"Deutsch"]
[null,null,null,null,null,null,null,null,null,null,null,null,null,null,null,"Norsk",null,1]
[null,null,null,null,null,null,null,null,null,null,null,null,null,null,null,"Español"]
[null,null,null,null,null,null,null,null,null,null,null,null,null,null,null,"Svenska"]
[null,null,null,null,null,null,null,null,null,null,null,null,null,null,null,"Čeština"]
[null,null,null,null,null,null,null,null,null,null,null,null,null,null,null,"ExtraTaal1"]
[null,null,null,null,null,null,null,null,null,null,null,null,null,null,null,"ExtraTaal2"]
[null,null,null,null,null,null,null,null,null,null,null,null,null,null,null,"ExtraTaal3"]
[null,null,null,null,null,null,null,null,null,null,null,null,null,null,null,{"$f":"IF('Micro Canal'!J4=data!$P$30,1,IF('Micro Canal'!J4=data!$P$31,2,IF('Micro Canal'!J4=data!$P$32,4,IF('Micro Canal'!J4=data!$P$33,3,IF('Micro Canal'!J4=data!$P$34,5,IF('Micro Canal'!J4=data!$P$35,6,IF('Micro Canal'!J4=data!$P$36,7,IF('Micro Canal'!J4=data!$P$37,8,IF('Micro Canal'!J4=data!$P$38,9,IF('Micro Canal'!J4=data!$P$39,10,IF('Micro Canal'!J4=data!$P$40,11,)))))))))))","v":6}]

{"sheet":"NL","index":2,"n_rows":22,"n_cols":10,"rows_kept":22,"cut":false,"hidden":true,"merged":[[15,0,17,0],[0,1,0,5],[8,4,8,6],[9,4,9,6],[10,4,10,6],[12,2,12,3],[12,4,12,5],[12,9,13,9],[12,8,13,8],[12,6,13,6],[12,7,13,7],[14,0,14,1]]}
[null,"Selectiontool Strada Hybrid"]
[]
[null,"Lengte",null,"mm","Invulformulier","Statisch toestel","rel. vocht.","Unit","Kopieer alle data"]
[null,"Hoogte",null,{"$f":"D3","v":"mm"},"Uitvoering","Hybrid toestel","Eenheidsstelsel","DBH set","SI-eenheden"]
[null,"Type",null,null,"Temperaturen","DBH rail type","Toestel",null,"Imperiale-eenheden"]
[null,"Diepte",null,{"$f":"D3","v":"mm"},"Indien de ventilatoren uitgeschakeld zijn, is de afgifte een indicatieve waarde.","Waterzijdig drukverlies"]
[]
[null,"Verwarmen:",null,null,null,null,"Koelen:"]
[null,"Water aanvoer",null,null,{"$f":"B9","v":"Water aanvoer"},null,null,null,{"$f":"D9","v":0}]
[null,"Water retour",null,{"$f":"D9","v":0},{"$f":"B10","v":"Water retour"},null,null,null,{"$f":"D9","v":0}]
[null,"Ruimte (droge bol)",null,{"$f":"D9","v":0},{"$f":"B11","v":"Ruimte (droge bol)"},null,null,null,{"$f":"D9","v":0}]
[]
[null,null,{"$f":"CONCATENATE(B8,\" \",C9,\"/\",C10,\"/\",C11)","v":"Verwarmen: //"},null,{"$f":"CONCATENATE(G8,\" \",H9,\"/\",H10,\"/\",H11)","v":"Koelen: //"},null,"Watervolume","Elektrisch verbruik [W]","Geluidsdrukniveau [dB(A)]****","Geluidsvermogen [dB(A)]****"]
[null,null,"Verwarmvermogen","Waterdebiet","Koelvermogen",{"$f":"D14","v":"Waterdebiet"}]
["Statisch (indicatieve waarde)"]
["EN16430","Ventilatorsnelheid "]
[null,"Ventilatorsnelheid 2"]
[null,"Ventilatorsnelheid 3"]
[null,"Stuurspanning [v]"]
["*","Koelvermogen is berekend volgens EN16430 met de ventilatoren naar boven blazend voor alle types."]
["**","Wanneer het watervolume in gallons wordt gegeven, zijn dit imperial gallons."]
["***","Geluidsvermogen volgens ISO 3741:2010, Voor het geluidsdrukniveau is er een aangenomen kamerdemping van 8 dB(A)."]

{"sheet":"EN","index":3,"n_rows":22,"n_cols":10,"rows_kept":22,"cut":false,"hidden":true,"merged":[[15,0,17,0],[0,1,0,5],[8,4,8,6],[9,4,9,6],[10,4,10,6],[12,2,12,3],[12,4,12,5],[12,9,13,9],[12,8,13,8],[12,7,13,7],[12,6,13,6],[14,0,14,1]]}
[null,"Selectiontool Strada Hybrid"]
[]
[null,"Length",null,"mm","Formulary","Static device","rel. humid.","Unit","Copy all data"]
[null,"Heigth",null,{"$f":"D3","v":"mm"},"Version","Hybrid device","Unit conversion","DBH set","SI-units"]
[null,"Type",null,null,"Temperatures","DBH rail type","Device",null,"Imperial-units"]
[null,"Depth",null,{"$f":"D3","v":"mm"},"If the fans are switched off, the output is an indicative value.","Water side pressure loss "]
[]
[null,"Heating:",null,null,null,null,"Cooling:"]
[null,"Supply water",null,null,{"$f":"B9","v":"Supply water"},null,null,null,{"$f":"D9","v":0}]
[null,"Return water",null,{"$f":"D9","v":0},{"$f":"B10","v":"Return water"},null,null,null,{"$f":"D9","v":0}]
[null,"Entering air (dry bulb)",null,{"$f":"D9","v":0},{"$f":"B11","v":"Entering air (dry bulb)"},null,null,null,{"$f":"D9","v":0}]
[]
[null,null,{"$f":"CONCATENATE(B8,\" \",C9,\"/\",C10,\"/\",C11)","v":"Heating: //"},null,{"$f":"CONCATENATE(G8,\" \",H9,\"/\",H10,\"/\",H11)","v":"Cooling: //"},null,"Water volume","Electrical consumption [W]","Sound pressure level [dB(A)]****","Sound power [dB(A)]****"]
[null,null,"Heating capacity","Water flow","Cooling capacity",{"$f":"D14","v":"Water flow"}]
["Fans off (indicative value)"]
["EN16430","Fan speed"]
[null,"Fan speed selection 2"]
[null,"Fan speed selection 3"]
[null,"Fan voltage [V]"]
["*","Cooling power is calcullated according EN16430 with fans blowing up for all heights."]
["**","When the water volume is given in gallons, the units are specifically imperial gallons."]
["***","Soundpower according to ISO 3741:2010, sound pressure level with assumed room damping of 8 dB(A)."]

{"sheet":"DE","index":4,"n_rows":22,"n_cols":10,"rows_kept":22,"cut":false,"hidden":true,"merged":[[15,0,17,0],[0,1,0,5],[8,4,8,6],[9,4,9,6],[10,4,10,6],[12,2,12,3],[12,4,12,5],[12,9,13,9],[12,8,13,8],[12,7,13,7],[12,6,13,6],[14,0,14,1]]}
[null,"Selectiontool Strada Hybrid"]
[]
[null,"Länge",null,"mm","Eingabefelder","Statisches Gerät","rel. Luftf.","Unit","Kopieren Sie alle daten"]
[null,"Höhe",null,{"$f":"D3","v":"mm"},"Ausführung","Hybrid Gerät","Einheiten","DBH set","SI-einheiten"]
[null,"Typ",null,null,"Temperaturen","DBH rail typ","Gerät",null,"Imperiale-einheiten"]
[null,"Tiefe",null,{"$f":"D3","v":"mm"},"Wenn die Lüfter ausgeschaltet sind, ist der Ausgang ein Richtwert.","zug. wassers. Druckverlust"]
[]
[null,"Heizen:",null,null,null,null,"Kühlen:"]
[null,"Vorlauf wasser",null,null,{"$f":"B9","v":"Vorlauf wasser"},null,null,null,{"$f":"D9","v":0}]
[null,"Rücklauf wasser",null,{"$f":"D9","v":0},{"$f":"B10","v":"Rücklauf wasser"},null,null,null,{"$f":"D9","v":0}]
[null,"Raum (trocken)",null,{"$f":"D9","v":0},{"$f":"B11","v":"Raum (trocken)"},null,null,null,{"$f":"D9","v":0}]
[]
[null,null,{"$f":"CONCATENATE(B8,\" \",C9,\"/\",C10,\"/\",C11)","v":"Heizen: //"},null,{"$f":"CONCATENATE(G8,\" \",H9,\"/\",H10,\"/\",H11)","v":"Kühlen: //"},null,"Wasservolumen","Elektr. Leistung [W]","Schalldruckpegel [dB(A)]****","Schallleistungspegel [dB(A)]****"]
[null,null,"Heizleistung","Heizmittelstrom","Kühlleistung","Kühlmittelstrom"]
["Lüfter aus (richtwert)"]
["EN16430","Auslegungsstufe "]
[null,"Auslegungsstufe 2"]
[null,"Auslegungsstufe 3"]
[null,"Lufterspannung [V]"]
["*","Die Kühlleistung wird nach EN 16430 berechnet, wobei die Lüfter für alle Höhen hochgehen."]
["**","Wenn das Wasservolumen in Gallonen angegeben ist, sind dies imperiale Gallonen."]
["***","Schallleistung nach ISO 3741: 2010, Schalldruckpegel bei angenommener Raumdämpfung von 8 dB(A)."]

{"sheet":"FR","index":5,"n_rows":22,"n_cols":10,"rows_kept":22,"cut":false,"hidden":true,"merged":[[15,0,17,0],[0,1,0,5],[8,4,8,6],[9,4,9,6],[10,4,10,6],[12,2,12,3],[12,4,12,5],[12,9,13,9],[12,8,13,8],[12,7,13,7],[12,6,13,6],[14,0,14,1]]}
[null,"Selectiontool Strada Hybrid"]
[]
[null,"Longeur",null,"mm","Formulaire","Appareil statique","hum. rel.","Unité","Copier toutes des données"]
[null,"Hauteur",null,{"$f":"D3","v":"mm"},"Version","Appareil Hybrid","Système unitaire","DBH set","Unités-SI"]
[null,"Type",null,null,"Températures","DBH rail type","Appareil",null,"Unités-Impériales"]
[null,"Profondeur",null,{"$f":"D3","v":"mm"},"Si les ventilateurs sont éteints, la sortie est une valeur indicative.","Perte de charge"]
[]
[null,"Chauffer:",null,null,null,null,"Refroidir:"]
[null,"Entrée de l'eau",null,null,{"$f":"B9","v":"Entrée de l'eau"},null,null,null,{"$f":"D9","v":0}]
[null,"Retour de l'eau",null,{"$f":"D9","v":0},{"$f":"B10","v":"Retour de l'eau"},null,null,null,{"$f":"D9","v":0}]
[null,"Ambiante (bulbe sec)",null,{"$f":"D9","v":0},{"$f":"B11","v":"Ambiante (bulbe sec)"},null,null,null,{"$f":"D9","v":0}]
[]
[null,null,{"$f":"CONCATENATE(B8,\" \",C9,\"/\",C10,\"/\",C11)","v":"Chauffer: //"},null,{"$f":"CONCATENATE(G8,\" \",H9,\"/\",H10,\"/\",H11)","v":"Refroidir: //"},null,"Volume d'eau","Puissance absorbée elec. [W]","Pression sonore [dB(A)]****","Puissance sonore [dB(A)]****"]
[null,null,"Puissance de chauffer","Débit d'eau","Puissance de refroidir",{"$f":"D14","v":"Débit d'eau"}]
["Ventilateur éteint (indicative)"]
["EN16430","Vitesse ventilateur "]
[null,"Vitesse du ventilateur 2"]
[null,"Vitesse du ventilateur 3"]
[null,"Tension ventilateur [V]"]
["*","La puissance de refroidissement est calculée selon EN 16430 avec des ventilateurs qui soufflent pour toutes les hauteurs."]
["**","Lorsque le volume d'eau est donné en gallons, ce sont des gallons impérial."]
["***","Puissance acoustique selon ISO 3741: 2010, niveau de pression acoustique avec un amortissement de la pièce supposé de 8 dB(A)."]

{"sheet":"NR","index":6,"n_rows":22,"n_cols":10,"rows_kept":22,"cut":false,"hidden":true,"merged":[[12,7,13,7],[12,8,13,8],[12,9,13,9],[14,0,14,1],[15,0,17,0],[0,1,0,5],[8,4,8,6],[9,4,9,6],[10,4,10,6],[12,2,12,3],[12,4,12,5],[12,6,13,6]]}
[null,"Selectiontool Strada Hybrid"]
[]
[null,"Lengde",null,"mm","Inngangsskjema","Statisk modell","rel. fuktighet","Unit","Kopier alle data"]
[null,"Høyde",null,{"$f":"D3","v":"mm"},"Versjon","Hybrid modell","Enhetssystem","DBH set","SI-enheter"]
[null,"Type",null,null,"Temperaturer","DBH rail type","Modell",null,"Imperiale-enheter"]
[null,"Bredde",null,{"$f":"D3","v":"mm"},"Hvis viftene er slått av, er utgangen en indikativ verdi.","Trykktap"]
[]
[null,"Varme:",null,null,null,null,"Kjøling:"]
[null,"Tur vann",null,null,{"$f":"B9","v":"Tur vann"},null,null,null,{"$f":"D9","v":0}]
[null,"Retur vann",null,0,{"$f":"B10","v":"Retur vann"},null,null,null,{"$f":"D9","v":0}]
[null,"Rom (tørr pære)",null,0,{"$f":"B11","v":"Rom (tørr pære)"},null,null,null,{"$f":"D9","v":0}]
[]
[null,null,{"$f":"CONCATENATE(B8,\" \",C9,\"/\",C10,\"/\",C11)","v":"Varme: //"},null,{"$f":"CONCATENATE(G8,\" \",H9,\"/\",H10,\"/\",H11)","v":"Kjøling: //"},null,"Vannvolum","Elektrisk effekt [W]","Lydtrykk [dB(A)]****","Lydeffekt [dB(A)]****"]
[null,null,"Varme effekt","Vannmengde","Kjøle effekt",{"$f":"D14","v":"Vannmengde"}]
["Lüfter aus (richtwert)"]
["EN16430","Styresignal"]
[null,"Auslegungsstufe 2"]
[null,"Auslegungsstufe 3"]
[null,"Viftespenning [V]"]
["*","Kjølekapasitet beregnes i henhold til EN16430 med viftene som blåser oppover for alle typer."]
["**","Når vannvolumet er gitt i gallon, er dette imperial gallons."]
["***","Lydeffekt i henhold til ISO 3741: 2010. For lydtrykknivået er det en antatt romdemping på 8 dB (A)."]

{"sheet":"SP","index":7,"n_rows":22,"n_cols":10,"rows_kept":22,"cut":false,"hidden":true,"merged":[[12,7,13,7],[12,8,13,8],[12,9,13,9],[14,0,14,1],[15,0,17,0],[0,1,0,5],[8,4,8,6],[9,4,9,6],[10,4,10,6],[12,2,12,3],[12,4,12,5],[12,6,13,6]]}
[null,"Selectiontool Strada Hybrid"]
[]
[null,"Longitud",null,"mm","Formulary","Dispositivo estático","Hum. Relativa","Unit","Copiar todos los datos"]
[null,"Altura",null,{"$f":"D3","v":"mm"},"Versión","Dispositivo Hybrid","Convers. de unidades","DBH set","Unidades-SI"]
[null,"Tipo",null,null,"Temperaturas","tipo de riel DBH","Despositivo",null,"Unidades-Imperial"]
[null,"Profund.",null,{"$f":"D3","v":"mm"},"La velocidad del ventilador en \"0\" tiene una emisión indicativa.","Pérdida de carga del agua"]
[]
[null,"Calefacción:",null,null,null,null,"Enfriamiento:"]
[null,"Agua impulsión",null,null,{"$f":"B9","v":"Agua impulsión"},null,null,null,{"$f":"D9","v":0}]
[null,"Agua retorno",null,{"$f":"D9","v":0},{"$f":"B10","v":"Agua retorno"},null,null,null,{"$f":"D9","v":0}]
[null,"Ambiente (bulbo seco)",null,{"$f":"D9","v":0},{"$f":"B11","v":"Ambiente (bulbo seco)"},null,null,null,{"$f":"D9","v":0}]
[]
[null,null,{"$f":"CONCATENATE(B8,\" \",C9,\"/\",C10,\"/\",C11)","v":"Calefacción: //"},null,{"$f":"CONCATENATE(G8,\" \",H9,\"/\",H10,\"/\",H11)","v":"Enfriamiento: //"},null,"Volumen de agua","Potencia eléctrica absorbida [W]","Presión sonora [dB(A)]****","Potencia sonora [dB(A)]****"]
[null,null,"Emisión calefacción","Caudal de agua, calefacción","Emisión sensible Frío",{"$f":"D14","v":"Caudal de agua, calefacción"}]
["Fans off (indicative value)"]
["EN16430","Velocidad del ventilador"]
[null,"Fan speed selection 2"]
[null,"Fan speed selection 3"]
[null," Voltaje control [V]"]
["*","La potencia de enfriamiento se calcula según la norma EN 16430 con ventiladores de todas las alturas."]
["**","Cuando el volumen de agua se da en galones, las unidades son específicamente galones imperiales."]
["***","Potencia sonora según ISO 3741: 2010, nivel de presión acústica con una amortiguación ambiental supuesta de 8 dB (A)."]

{"sheet":"SW","index":8,"n_rows":22,"n_cols":10,"rows_kept":22,"cut":false,"hidden":true,"merged":[[12,7,13,7],[12,8,13,8],[12,9,13,9],[14,0,14,1],[15,0,17,0],[0,1,0,5],[8,4,8,6],[9,4,9,6],[10,4,10,6],[12,2,12,3],[12,4,12,5],[12,6,13,6]]}
[null,"Selectiontool Strada Hybrid"]
[]
[null,"Délka",null,"mm","Formulary","Statická jednotka","Relativní vlhkost","Jednotka","Kopírovat všechna data"]
[null,"Výška",null,{"$f":"D3","v":"mm"},"Verze","Hybridní jednotka","Převod jednotek","DBH sada","Mezinárodní (Sl)"]
[null,"Typ",null,null,"Teploty","DBH rail type","Device",null,"Imperiální"]
[null,"Hloubka",null,{"$f":"D3","v":"mm"},"Pokud jsou ventilátory vypnuté, je výkon pouze orientační.","Tlaková ztráta"]
[]
[null,"Topení:",null,null,null,null,"Chlazení:"]
[null,"Voda na přívodu",null,null,{"$f":"B9","v":"Voda na přívodu"},null,null,null,{"$f":"D9","v":0}]
[null,"Voda na zpátečce",null,{"$f":"D9","v":0},{"$f":"B10","v":"Voda na zpátečce"},null,null,null,{"$f":"D9","v":0}]
[null,"teplota vzduchu",null,{"$f":"D9","v":0},{"$f":"B11","v":"teplota vzduchu"},null,null,null,{"$f":"D9","v":0}]
[]
[null,null,{"$f":"CONCATENATE(B8,\" \",C9,\"/\",C10,\"/\",C11)","v":"Topení: //"},null,{"$f":"CONCATENATE(G8,\" \",H9,\"/\",H10,\"/\",H11)","v":"Chlazení: //"},null,"Objem vody","Spotřeba elektrické energie [W]","Akustický tlak [dB(A)]****","Akustický výkon [dB(A)]****"]
[null,null,"Výkon Topení","Průtok vzduchu","Výkon Chlazení","Průtok vody"]
["Fans off (indicative value)"]
["EN16430","Rychlost otáček ventilátoru"]
[null,"Fan speed selection 2"]
[null,"Fan speed selection 3"]
[null,"Napětí ventilárotu [V]"]
["*","Chladicí výkon vypočítán podle EN 16430  s ventilátory, které u všech typů - výšek foukají nahoru."]
["**"]
["***","Akustický výkon podle ISO 3741: 2010, hladina akustického tlaku s předpokládaným útlumem místnosti o 8 dB (A)."]

{"sheet":"TS","index":9,"n_rows":22,"n_cols":10,"rows_kept":22,"cut":false,"hidden":true,"merged":[[0,1,0,5],[8,4,8,6],[9,4,9,6],[10,4,10,6],[12,2,12,3],[12,4,12,5],[12,6,13,6],[12,7,13,7],[12,8,13,8],[12,9,13,9],[14,0,14,1],[15,0,17,0]]}
[null,"Selectiontool Strada Hybrid"]
[]
[null,"Délka",null,"mm","Formulary","Statická jednotka","Relativní vlhkost","Jednotka","Kopírovat všechna data"]
[null,"Výška",null,{"$f":"D3","v":"mm"},"Verze","Hybridní jednotka","Převod jednotek","DBH sada","Mezinárodní (Sl)"]
[null,"Typ",null,null,"Teploty","DBH rail type","Device",null,"Imperiální"]
[null,"Hloubka",null,{"$f":"D3","v":"mm"},"Pokud jsou ventilátory vypnuté, je výkon pouze orientační.","Tlaková ztráta"]
[]
[null,"Topení:",null,null,null,null,"Chlazení:"]
[null,"Voda na přívodu",null,null,{"$f":"B9","v":"Voda na přívodu"},null,null,null,{"$f":"D9","v":0}]
[null,"Voda na zpátečce",null,{"$f":"D9","v":0},{"$f":"B10","v":"Voda na zpátečce"},null,null,null,{"$f":"D9","v":0}]
[null,"\"Suchá\" teplota vzduchu",null,{"$f":"D9","v":0},{"$f":"B11","v":"\"Suchá\" teplota vzduchu"},null,null,null,{"$f":"D9","v":0}]
[]
[null,null,{"$f":"CONCATENATE(B8,\" \",C9,\"/\",C10,\"/\",C11)","v":"Topení: //"},null,{"$f":"CONCATENATE(G8,\" \",H9,\"/\",H10,\"/\",H11)","v":"Chlazení: //"},null,"Objem vody","Elektrický výkon [W]","Akustický tlak [dB(A)]****","Akustický výkon [dB(A)]****"]
[null,null,"Výkon Topení","Průtok vody","Výkon Chlazení","Průtok vody"]
["Fans off (indicative value)"]
["EN16430","Rychlost otáček ventilátoru"]
[null,"Fan speed selection 2"]
[null,"Fan speed selection 3"]
[null,"Napětí ventilárotu [V]"]
["*","Chladicí výkon vypočítán podle EN 16430  s ventilátory, které u všech typů - výšek foukají nahoru."]
["**","Když je objem vody uveden v galonech, jednotky jsou konkrétně imperiální galony. "]
["***","Akustický výkon podle ISO 3741: 2010, hladina akustického tlaku s předpokládaným útlumem místnosti o 8 dB (A)."]

{"sheet":"ExtraTaal1","index":10,"n_rows":22,"n_cols":10,"rows_kept":22,"cut":false,"hidden":true,"merged":[[12,7,13,7],[12,8,13,8],[12,9,13,9],[14,0,14,1],[15,0,17,0],[0,1,0,5],[8,4,8,6],[9,4,9,6],[10,4,10,6],[12,2,12,3],[12,4,12,5],[12,6,13,6]]}
[null,"Selectiontool Strada Hybrid"]
[]
[null,"Length",null,"mm","Formulary","Static device","rel. humid.","Unit"]
[null,"Heigth",null,{"$f":"D3","v":"mm"},"Version","Hybrid device","Unit conversion"]
[null,"Width",null,null,"Temperatures","DBH rail type","Device"]
[null,"Depth",null,{"$f":"D3","v":"mm"},"Setting 0 is indicative","Water side pressure loss "]
[]
[null,"Heating:",null,null,null,null,"Cooling:"]
[null,"Supply water",null,null,{"$f":"B9","v":"Supply water"},null,null,null,{"$f":"D9","v":0}]
[null,"Return water",null,{"$f":"D9","v":0},{"$f":"B10","v":"Return water"},null,null,null,{"$f":"D9","v":0}]
[null,"Entering air (dry bulb)",null,{"$f":"D9","v":0},{"$f":"B11","v":"Entering air (dry bulb)"},null,null,null,{"$f":"D9","v":0}]
[]
[null,null,{"$f":"CONCATENATE(B8,\" \",C9,\"/\",C10,\"/\",C11)","v":"Heating: //"},null,{"$f":"CONCATENATE(G8,\" \",H9,\"/\",H10,\"/\",H11)","v":"Cooling: //"},null,"Water volume","Electrical consumption [W]","Sound pressure level [dB(A)]****","Sound power [dB(A)]****"]
[null,null,"Heating capacity","Water flow","Cooling capacity",{"$f":"D14","v":"Water flow"}]
["Fans off (indicative value)"]
["EN16430","Fan speed"]
[null,"Fan speed selection 2"]
[null,"Fan speed selection 3"]
[null,"Fan voltage [V]"]
["*","Cooling power is calcullated according EN16430 with fans blowing up for all heights."]
["**","When the water volume is given in gallons, the units are specifically imperial gallons."]
["***","Soundpower according to ISO 3741:2010, sound pressure level with assumed room damping of 8 dB(A)."]

{"sheet":"ExtraTaal2","index":11,"n_rows":22,"n_cols":10,"rows_kept":22,"cut":false,"hidden":true,"merged":[[12,7,13,7],[12,8,13,8],[12,9,13,9],[14,0,14,1],[15,0,17,0],[0,1,0,5],[8,4,8,6],[9,4,9,6],[10,4,10,6],[12,2,12,3],[12,4,12,5],[12,6,13,6]]}
[null,"Selectiontool Strada Hybrid"]
[]
[null,"Length",null,"mm","Formulary","Static device","rel. humid.","Unit"]
[null,"Heigth",null,{"$f":"D3","v":"mm"},"Version","Hybrid device","Unit conversion"]
[null,"Width",null,null,"Temperatures","DBH rail type","Device"]
[null,"Depth",null,{"$f":"D3","v":"mm"},"Setting 0 is indicative","Water side pressure loss "]
[]
[null,"Heating:",null,null,null,null,"Cooling:"]
[null,"Supply water",null,null,{"$f":"B9","v":"Supply water"},null,null,null,{"$f":"D9","v":0}]
[null,"Return water",null,{"$f":"D9","v":0},{"$f":"B10","v":"Return water"},null,null,null,{"$f":"D9","v":0}]
[null,"Entering air (dry bulb)",null,{"$f":"D9","v":0},{"$f":"B11","v":"Entering air (dry bulb)"},null,null,null,{"$f":"D9","v":0}]
[]
[null,null,{"$f":"CONCATENATE(B8,\" \",C9,\"/\",C10,\"/\",C11)","v":"Heating: //"},null,{"$f":"CONCATENATE(G8,\" \",H9,\"/\",H10,\"/\",H11)","v":"Cooling: //"},null,"Water volume","Electrical consumption [W]","Sound pressure level [dB(A)]****","Sound power [dB(A)]****"]
[null,null,"Heating capacity","Water flow","Cooling capacity",{"$f":"D14","v":"Water flow"}]
["Fans off (indicative value)"]
["EN16430","Fan speed"]
[null,"Fan speed selection 2"]
[null,"Fan speed selection 3"]
[null,"Fan voltage [V]"]
["*","Cooling power is calcullated according EN16430 with fans blowing up for all heights."]
["**","When the water volume is given in gallons, the units are specifically imperial gallons."]
["***","Soundpower according to ISO 3741:2010, sound pressure level with assumed room damping of 8 dB(A)."]

{"sheet":"ExtraTaal3","index":12,"n_rows":22,"n_cols":10,"rows_kept":22,"cut":false,"hidden":true,"merged":[[12,7,13,7],[12,8,13,8],[12,9,13,9],[14,0,14,1],[15,0,17,0],[0,1,0,5],[8,4,8,6],[9,4,9,6],[10,4,10,6],[12,2,12,3],[12,4,12,5],[12,6,13,6]]}
[null,"Selectiontool Strada Hybrid"]
[]
[null,"Length",null,"mm","Formulary","Static device","rel. humid.","Unit"]
[null,"Heigth",null,{"$f":"D3","v":"mm"},"Version","Hybrid device","Unit conversion"]
[null,"Width",null,null,"Temperatures","DBH rail type","Device"]
[null,"Depth",null,{"$f":"D3","v":"mm"},"Setting 0 is indicative","Water side pressure loss "]
[]
[null,"Heating:",null,null,null,null,"Cooling:"]
[null,"Supply water",null,null,{"$f":"B9","v":"Supply water"},null,null,null,{"$f":"D9","v":0}]
[null,"Return water",null,{"$f":"D9","v":0},{"$f":"B10","v":"Return water"},null,null,null,{"$f":"D9","v":0}]
[null,"Entering air (dry bulb)",null,{"$f":"D9","v":0},{"$f":"B11","v":"Entering air (dry bulb)"},null,null,null,{"$f":"D9","v":0}]
[]
[null,null,{"$f":"CONCATENATE(B8,\" \",C9,\"/\",C10,\"/\",C11)","v":"Heating: //"},null,{"$f":"CONCATENATE(G8,\" \",H9,\"/\",H10,\"/\",H11)","v":"Cooling: //"},null,"Water volume","Electrical consumption [W]","Sound pressure level [dB(A)]****","Sound power [dB(A)]****"]
[null,null,"Heating capacity","Water flow","Cooling capacity",{"$f":"D14","v":"Water flow"}]
["Fans off (indicative value)"]
["EN16430","Fan speed"]
[null,"Fan speed selection 2"]
[null,"Fan speed selection 3"]
[null,"Fan voltage [V]"]
["*","Cooling power is calcullated according EN16430 with fans blowing up for all heights."]
["**","When the water volume is given in gallons, the units are specifically imperial gallons."]
["***","Soundpower according to ISO 3741:2010, sound pressure level with assumed room damping of 8 dB(A)."]